انسجام اجتماعی
type: Concept
preferred label: Social integration @en
related: مشکل نسل دوم

مشکل نسل دوم
type: Concept
preferred label: Second generation problem @en
related: انسجام اجتماعی
related: مهاجرت
scope note: اشاره است به مسائل و مشكلات مربوط به فرزندان والدینی كه به كشور خاص مهاجرت كرده‌اند.

مهاجرت
type: Concept
preferred label: Migration @en
related: مشکل نسل دوم