درمان پزشکی
type: Concept
preferred label: Medical treatment @en
related: بهداشتی کردن

بهداشتی کردن
type: Concept
preferred label: Medicalization @en
related: درمان پزشکی
related: بستری کردن (شدن)
scope note: فرایند ترویج و ارتقای پزشكی و درمان در جامعه. یا روند روز افزون چسباندن برچسبهای پزشكی بر رفتارهایی كه از نظر اجتماعی یا اخلاقی نامطلوب شمرده می‌شوند. معنی ضمنی چنین روندی این است كه علوم پزشكی و بهداشتی جدید می‌توانند كلیه مسائل (مثل قلدری، شرارت، الكلیسم، همجنس بازی، بد رانندگی كردن) را همین‌كه به عنوان بیماری شناخته شدند، درمان كنند.

بستری کردن (شدن)
type: Concept
preferred label: Institutionalization @en
related: بهداشتی کردن