گیاه‌درمانی
type: Concept
alternative label: پزشكي علفي
broader: پزشکی تکمیلی
preferred label: Herbalism @en
scope note: درمان با استفاده از گیاهان دارویی یا داروهای گیاهی.

پزشکی تکمیلی
type: Concept
narrower: گیاه‌درمانی
preferred label: Complementary medicine @en