استخوان‌درمانی
type: Concept
broader: پزشکی تکمیلی
preferred label: Osteopathy @en
related: فیزیوتراپی
scope note: شیوه‌ای در درمان بیماریهای استخوانی با دستكاری ماهرانه استخوانها و مفصلها.

پزشکی تکمیلی
type: Concept
narrower: استخوان‌درمانی
preferred label: Complementary medicine @en

فیزیوتراپی
type: Concept
preferred label: Physiotherapy @en
related: استخوان‌درمانی