آرامبخش
type: Concept
alternative label: داروي آرامبخش
broader: دارو
preferred label: Tranquillizer @en
scope note: داروهایی كه همه آنها در یك یا چند ویژگی زیر مشتركند: ضد اضطراب، مسكن، شل‌كننده عضلانی، ضد تشنج، ضد بی‌تابی.

دارو
type: Concept
narrower: آرامبخش
preferred label: Medicine (Drug) @en