مطالعه گروهه‌ای
type: Concept
broader: روش پژوهش
preferred label: Cohort study @en
scope note: گروهه یا رسته همدوره، بیانگر گروه اشخاصی است كه از جنبه تجربه كردن یك رویداد معنادار در یك مرحله زمانی معین، وجه اشتراك داشته باشند. مثلا تمام كودكانی كه در یك سال به دنیا آمده‌اند، گروهه متولدین همدوره آن سال را تشكیل می‌دهند. تجزیه و تحلیل و مطالعه گروهه همدوره كه تاریخ چنین گروهه‌ای را در طول زمان پیگیری می‌كند، برای گردآوری اطلاعات لازم در مطالعه باروری، مراقبت بهداشتی، آموزش و پرورش و اشتغال مورد بررسی قرار می‌گیرد.

روش پژوهش
type: Concept
narrower: مطالعه گروهه‌ای
preferred label: Research method @en