کارآزمایی با گروه شاهد تصادفی انتخاب‌شده
type: Concept
broader: روش پژوهش
preferred label: Randomized controlled trial @en
scope note: آزمایش یا آزمونی كه در آن، آزمودنیهای یك جمعیت به طور اتفاقی به گروهها (موسوم به گروه شاهد یا گروه مطالعه) اختصاص می‌یابد كه به این گروهها رویه پیشگیرانه یا درمانی تجربی، دستكاری یا مداخله داده می‌شود یا داده نمی‌شود. آنگاه نتایج حاصل از مقایسه دقیق میزان بیماری، مرگ، بهبود یا یك نتیجه متناسب دیگر در گروههای مطالعه وشاهد اندازه‌گیری می‌شود.

روش پژوهش
type: Concept
narrower: کارآزمایی با گروه شاهد تصادفی انتخاب‌شده
preferred label: Research method @en