رفتار وسواسی
type: Concept
alternative label: رفتار اجباري
broader: رفتار
preferred label: Compulsive behaviour @en
scope note: رفتار حركتی تكراری، كلیشه‌ای و معمولا بی‌اهمیت كه نیاز به انجام آن، مصرانه خود را وارد هشیاری فرد می كند، در حالی كه او مایل به انجام آن نیست. انجام ندادن عمل، باعث تنش و اضطراب فزاینده می‌شود.

رفتار
type: Concept
narrower: رفتار وسواسی
preferred label: Behaviour @en