آمیزش جنسی دهانی
type: Concept
broader: رفتار جنسی
preferred label: Oral sex @en
scope note: آمیزش جنسی از طریق دهان كه منشا بیماریهای عفونی و آمیزشی خطرناك می‌شود.

رفتار جنسی
type: Concept
narrower: آمیزش جنسی دهانی
preferred label: Sexual behaviour @en