دگرسکس‌جویی
type: Concept
alternative label: نارضايتي جنسيتي
broader: تمایلات جنسی
preferred label: Transsexuality @en
scope note: یكی از اختلالات هویت جنسی كه ویژگی اساسی آن، احساس ناراحتی و نارضایتی عمیق و دائم در مورد جنس معین خود، و اعتقاد عمیق به متعلق بودن به جنس مقابل آنچه اعضای تناسلی خارجی طبیعی او نشان می‌دهد، است.

تمایلات جنسی
type: Concept
narrower: دگرسکس‌جویی
preferred label: Sexuality @en