انگیزش
type: Concept
preferred label: Motivation @en
related: ارزش
related: تقویت
scope note: تحریك، كنترل و راهنمایی فعالیت فرد به سوی هدف معین.

ارزش
type: Concept
preferred label: Value @en
related: انگیزش

تقویت
type: Concept
preferred label: Reinforcement @en
related: انگیزش