خواهر- برادر
type: Concept
alternative label: هم‌نيا
preferred label: Sibling @en
related: رابطه خانوادگی
scope note: یك فرد از دسته‌ای كه همه از والدین مشتركی بوجود آمده‌اند.

رابطه خانوادگی
type: Concept
preferred label: Family relation @en
related: خواهر- برادر