حکومت منطقه‌ای
type: Concept
broader: حکومت
preferred label: Regional government @en
scope note: حكومت منطقه‌ای در یك كشور، از طریق تفویض اختیارات اداری از طرف حكومت مركزی به منطقه یا ناحیه مورد نظر.

حکومت
type: Concept
narrower: حکومت منطقه‌ای
preferred label: Government @en