سازمان غیر دولتی
type: Concept
alternative label: تشكل غير دولتي
broader: سازمان
preferred label: Non-governmental organization @en
scope note: دسته‌ای از سازمانها كه دولتها در ایجاد و اداره آنها نقشی ندارند و به وسیله افراد و مؤسسات خصوصی كشورهای مختلف برای نیل به یك هدف یا هدفهای مشترك معین به‌وجود آمده‌اند. این قبیل سازمانها از جامعه مدنی برخاسته‌اند، از متخصصان هر رشته تشكیل شده‌اند و به روش ایجاد ارتباط بین ارگانهای دولتی و مردم واقف هستند.

سازمان
type: Concept
narrower: سازمان غیر دولتی
preferred label: Organization @en