فرهنگ
type: Concept
broader: جامعه
preferred label: Culture @en

نظام اقتصادی
type: Concept
broader: جامعه
preferred label: Economic system @en

جامعه
type: Concept
narrower: فرهنگ
narrower: نظام اقتصادی
preferred label: Society @en
scope note: گروهی وسیع، شامل سازمانهای متعدد و مركب از عده كثیری زن، مرد و كودك كه در طی زمان طولانی، از اتكای متقابل اجتماعی و نظم گروهی بهره‌مند باشند.