فشار روانی پس‌آسیبی
type: Concept
alternative label: استرس پس از سانحه
broader: فشار روانی
preferred label: Post-traumatic stress @en
scope note: فشار روانی پس از حادثه یا اضطراب حاد به دنبال فرار از مرگ حتمی در جبهه جنگ، تصادف یا سانحه طبیعی و مانند اینها.

فشار روانی
type: Concept
narrower: فشار روانی پس‌آسیبی
preferred label: Stress @en