سلامت برای همه
type: Concept
alternative label: بهداشت براي همه
broader: برنامه ارتقای بهداشت
preferred label: Health for all @en
scope note: مراقبت از تندرستی به شرح آنچه در بیانیه موسوم به آلماآتا در سال 1978 آم‍ده است. سلامت برای همه به عنوان هدف نهایی برای دسترسی در سال 2000 میلادی مطرح شده بود كه بر اساس آن با اجرای مراقبت بهداشتی برای همه مردم جهان یا یك كشور و یا یك منطقه امكان‌پذیر است. بیانیه موسوم به جاكارتا (1997) نیز برای ارتقای بهداشت در قرن 21 اولویتهایی را در نظر گرفته است.

برنامه ارتقای بهداشت
type: Concept
narrower: سلامت برای همه
preferred label: Health promotion programme @en