مدرسه
type: Concept
preferred label: School @en
related: انجمن اولیا و مربیان

والدین
type: Concept
preferred label: Parents @en
related: انجمن اولیا و مربیان

انجمن اولیا و مربیان
type: Concept
preferred label: Parents' evening @en
related: مدرسه
related: والدین
scope note: جلسه یا نشست اولیا و مربیان مدارس برای تبادل نظر در مورد وضعیت تحصیلی و مسائل تربیتی دانش‌آموزان.