دیافراگم (وسیله جلوگیری از آبستنی)
type: Concept
alternative label: جدار (ديافراگم)
broader: جلوگیری‌کننده از آبستنی
preferred label: Diaphragm @en
scope note: وسیله لاستیكی گنبدی شكل برای جلوگیری از آبستنی كه داخل مهبل زن قرار داده می‌شود تا از ورود منی به داخل رحم (زهدان) جلوگیری كند.

جلوگیری‌کننده از آبستنی
type: Concept
narrower: دیافراگم (وسیله جلوگیری از آبستنی)
preferred label: Contraceptive @en