جلوگیری فوری از آبستنی
type: Concept
alternative label: قرص ضد آبستني روز بعد
broader: جلوگیری‌کننده از آبستنی
preferred label: Emergency contraception @en
scope note: رژیم مصرف قرصهای ضد آبستنی تا سه روز بعد از آمیزش جنسی به منظور پیشگیری از بارور شدن تخمك در رحم زن. جلوگیری فوری از آبستنی معمولا به دو صورت انجام می‌شود. یكی مصرف قرصهای جلوگیری اضطراری دارای دوز بالای هورمونهای جنسی زنانه و دیگری، وسایل جلوگیری داخل‌رحمی مانند آی.یو.دی است.

جلوگیری‌کننده از آبستنی
type: Concept
narrower: جلوگیری فوری از آبستنی
preferred label: Contraceptive @en