جلوگیری طبیعی از آبستنی
type: Concept
broader: جلوگیری‌کننده از آبستنی
preferred label: Natural contraception @en
scope note: روش جلوگیری طبیعی از آبستنی كه از جمله شامل پرهیز دوره‌ای تا 16 روز بعد از قاعدگی و آمیزش منقطع است.

جلوگیری‌کننده از آبستنی
type: Concept
narrower: جلوگیری طبیعی از آبستنی
preferred label: Contraceptive @en