جلوگیری‌کننده از آبستنی
type: Concept
broader: تشریک مساعی سالم
preferred label: Contraceptive @en

تشریک مساعی سالم
type: Concept
narrower: جلوگیری‌کننده از آبستنی
preferred label: Healthy alliance @en
related: همکاری
scope note: همكاری بین دو یا چند نفر یا گروه در اقدامی مشترك، مثل همكاری بین شركتهای داروسازی با گروههای بیماران در سطح ملی یا شراكت دو یا چند طرف برای نیل به هدفهای ارتقای بهداشت.

همکاری
type: Concept
preferred label: Cooperation @en
related: تشریک مساعی سالم