سوراخ- راهی از بدن (با جراحی)
type: Concept
alternative label: كولون‌سنبي
broader: جراحی
preferred label: Stoma @en
scope note: سوراخ دهان‌مانند بویژه راه ساختگی یا مدخلی كه با برش درست شده است، مانند برش كولون.

جراحی
type: Concept
narrower: سوراخ- راهی از بدن (با جراحی)
preferred label: Surgery @en