همجنس‌باز مرد
type: Concept
alternative label: مرد همجنس‌خواه
broader: همجنس‌باز
preferred label: Gay man @en
scope note: گرایش جنسی به همجنس در مردان.واژه Gay به معنی شنگول، شاد و بی خیال از دهه 1970 به مفهوم هرزه و همجنس‌باز به‌كار رفته است. تاثیر مخرب بیماری ایدز بر افراد جامعه همجنس‌بازان موجب انجام پژوهشها و مطالعات همه‌گیری‌شناختی شد كه بسیاری از جزئیات سیر طبیعی بیماری ایدز را روشن كرد و به آموزش موثر بهداشت با هدف مبارزه با همه‌گیری این بیماری كشنده انجامید.

همجنس‌باز
type: Concept
narrower: همجنس‌باز مرد
preferred label: Homosexual person @en