چربی
type: Concept
preferred label: Lipid @en
related: کلسترول

کلسترول
type: Concept
broader: بدن انسان
preferred label: Cholesterol @en
related: چربی
scope note: نوعی ماده استروئیدی كه به‌طور طبیعی در سلولها، بافتها و مایعات بدن، در مغز، نخاع و غده فوق‌كلیوی و در پوست وجود دارد و جگر و بعضی اندامهای دیگر، آن را می‌سازند. در چربی و روغنهای حیوانی یافت می‌شود به تنهایی یا همراه رنگدانه‌های صفرایی بخش بزرگی از سنگهای صفرایی را می‌سازد. در تصلب شرائین در جدار سرخرگها راسب می‌شود.

بدن انسان
type: Concept
narrower: کلسترول
preferred label: Human body @en