فناوری اطلاعات و ارتباطات
type: Concept
broader: فناوری
preferred label: Information and communication technology @en

فناوری
type: Concept
alternative label: تكنولوژي
narrower: فناوری اطلاعات و ارتباطات
preferred label: Technology @en
scope note: دانش فنی، شیوه ساختن اشیا و انجام كارها، ماشینها و ابزارهای كم و بیش پیچیده برای پاسخگویی به نیاز انسان.