سیاست پژوهشی
type: Concept
broader: سیاست (خط‌مشی)
preferred label: Research policy @en
related: پژوهش
scope note: خط‌مشی‌ها و تصمیماتی كه در مورد پژوهش (بنیادی، كاربردی، توسعه‌ای)، منابع تامین نیازهای مالی، ارزشیابی برنامه‌ها و اولویتهای پژوهشی اتخاذ می‌شود. سیاست پژوهشی یكی از سه بخش سیاست علمی جامعه است كه همراه با آموزش و تبادل فناوری، مجموعه سیاست علمی آن جامعه را می‌سازد.

سیاست (خط‌مشی)
type: Concept
narrower: سیاست پژوهشی
preferred label: Policy @en

پژوهش
type: Concept
preferred label: Research @en
related: سیاست پژوهشی