آلودگی نوری
type: Concept
broader: آلودگی
preferred label: Light pollution @en
scope note: استفاده نابجا، ناخواسته، غیر ضروری، غیر مجاز و بیش از حد استاندارد از نور.

آلودگی
type: Concept
narrower: آلودگی نوری
preferred label: Pollution @en