فرصت برابر
type: Concept
preferred label: Equal opportunity @en
related: نابرابری بهداشتی

همه‌گیری‌شناسی
type: Concept
preferred label: Epidemiology @en
related: نابرابری بهداشتی

نابرابری بهداشتی
type: Concept
alternative label: نابرابريهاي در بهداشت
preferred label: Inequality in health @en
related: همه‌گیری‌شناسی
related: فرصت برابر
scope note: گوناگونی در شاخصها یا نشانگرهای بهداشتی مرتبط با وضعیت اقتصادی و اجتماعی.