سندرم جنینی ناشی از الکل
type: Concept
alternative label: سندرم الكل جنيني
broader: عوارض آبستنی
preferred label: Fetal alcohol syndrome @en
related: اعتیاد به الکل
scope note: مجموعه‌ای از خصوصیات نابهنجار مربوط به رشد در جنین كه از الكلیسم مادر ناشی می‌‌شود. سطح بالای الكل خون همراه با كاهش سطح مواد مغذی طبیعی ممكن است به بروز هر یك از نقصهای تشریحی و روانشناختی، از جمله میكروسفالی، عقب ماندگی ذهنی، فزونكاری و نقصهای مربوط به رشد منتهی شود.

عوارض آبستنی
type: Concept
narrower: سندرم جنینی ناشی از الکل
preferred label: Pregnancy complications @en

اعتیاد به الکل
type: Concept
preferred label: Alcoholism @en
related: سندرم جنینی ناشی از الکل