کودک خیابانی
type: Concept
preferred label: Street child @en
related: مدرسه گریزی

مدرسه گریزی
type: Concept
alternative label: گريز از مدرسه
preferred label: Truancy @en
related: کودک خیابانی
scope note: غیبت عمدی دانش‌آموز از مدرسه، بدون اطلاع و موافقت خانواده‌اش و بدون اینكه عذر موجهی داشته باشد.