تاثیر متغیرخارجی
type: Concept
preferred label: Variable external influence @en
related: تقویت
related: کانون کنترل
scope note: تاثیر عوامل متغیر (مستقل یا وابسته یا میانجی) خارجی در فرد یا مورد پژوهش.

تقویت
type: Concept
preferred label: Reinforcement @en
related: تاثیر متغیرخارجی

کانون کنترل
type: Concept
preferred label: Locus of control @en
related: تاثیر متغیرخارجی