بحث گروهی
type: Concept
preferred label: Group discussion @en
related: روش بحث

روش ‌دادن خبرهای‌ بد
type: Concept
broader: روش بحث
preferred label: Technique for breaking bad news @en

روش بحث
type: Concept
alternative label: روش بحث و گفتگو
narrower: روش ‌دادن خبرهای‌ بد
preferred label: Discussion technique @en
related: بحث گروهی
scope note: گفتگوی دو یا چند نفر درباره موضوعی، و اینكه هر كس بكوشد تا با آوردن دلایل و شواهد نظر خود را ثابت كند. بحث مانند یك ورزش فكری- بیانی است و باید قواعد مشخص داشته باشد تا آشكار شود كه نتیجه آن چیست.