خواندن‌پریشی
type: Concept
alternative label: نارسا‌خواني
broader: ناتوانی یادگیری
preferred label: Dyslexia @en
scope note: اختلال مربوط به رشد در خواندن. این اختلال با نقص قابل ملاحظه در پیدایش مهارتهای شناخت كلمات و فهم مطالب خوانده شده مشخص است كه با عقب ماندگی ذهنی و آموزش ناكافی قابل توجیه نبوده و ناشی از عیوب بینایی و شنوایی و اختلالات عصبی نیست.

ناتوانی یادگیری
type: Concept
narrower: خواندن‌پریشی
preferred label: Learning disability @en