آبله‌مرغان
type: Concept
alternative label: واريسلا
broader: بیماری دوران کودکی
preferred label: Chickenpox @en
scope note: بیماری ویروسی واگیر دوران كودكی كه در نخستین روز بیماری، دانه‌هایی روی سینه پدیدار می‌شود. دوره نهفته آن دو تا شانزده روز است. سیر بیماری دو هفته طول می‌كشد. جدا‌سازی بیمار به مدت بیست روز ضروری است.

بیماری دوران کودکی
type: Concept
narrower: آبله‌مرغان
preferred label: Childhood disease @en