سرماخوردگی
type: Concept
broader: بیماری واگیر
preferred label: Common cold @en
scope note: این بیماری با علائم عطسه، گرفتگی بینی و مختصری سرفه مشخص می‌شود و ممكن است در تمام طول سال رخ دهد.

بیماری واگیر
type: Concept
narrower: سرماخوردگی
preferred label: Communicable disease @en