آنفلوانزا
type: Concept
alternative label: گريپ
broader: بیماری واگیر
preferred label: Influenza @en
scope note: بیماری ویروسی كه اغلب در فصل زمستان و با تب ناگهانی و شدید، سردرد، درد شدید عضلات و سرفه شدید مشخص می‌شود. سپس علائم دستگاه تنفس به شكل گلودرد، گرفتگی و ترشح بینی و سرفه واضح‌تر می‌شود و گاهی دردشكم، تهوع و استفراغ و قرمزی چشمها نیز به علائم بیماری اضافه می‌شود.

بیماری واگیر
type: Concept
narrower: آنفلوانزا
preferred label: Communicable disease @en