زگیل تناسلی
type: Concept
broader: بیماری آمیزشی
preferred label: Genital wart @en
scope note: تومور خوشخیم جلدی كه در اثر آلودگی به ویروس پاپیلوم انسانی (اچ.پی.وی ‌6 ، 11، 16، 18) به‌وجود می‌آید.

بیماری آمیزشی
type: Concept
narrower: زگیل تناسلی
preferred label: Sexually transmitted disease @en