بیماری آلزایمر
type: Concept
broader: زوال عقل
preferred label: Alzheimer’s disease @en

زوال عقل
type: Concept
alternative label: عقل‌فرسودگي
broader: اختلال روانی
narrower: بیماری آلزایمر
preferred label: Dementia @en
scope note: اختلال مزمن فرایندهای روانی كه با روانپریشی، موقعیت ناشناسی، اختلال در حافظه و بی‌‌شعوری همراه است.

اختلال روانی
type: Concept
narrower: زوال عقل
preferred label: Mental disorder @en