زایمان
type: Concept
preferred label: Childbirth @en
related: افسردگی پس از زایمان

افسردگی پس از زایمان
type: Concept
broader: افسردگی
preferred label: Postnatal depression @en
related: زایمان
scope note: معمولا دو هفته پس از زایمان شروع می‌شود. خستگی، تحریك‌پذیری و اضطراب معمولا آشكارتر از تغییر خلق و افسردگی است و امكان دارد علائم آشكار ترس شدید هم وجود داشته باشد. مشاهدات بالینی حاكی است كه این اختلالات معمولا تحت تاثیر انطباقهای روانشناختی لازم پس از تولد بچه و نیز كم‌خوابی و كار سخت بچه‌داری است.

افسردگی
type: Concept
narrower: افسردگی پس از زایمان
preferred label: Depression @en