بیماری گرسنگی
type: Concept
alternative label: سيري‌ناپذيري
broader: اختلال در غذا خوردن
preferred label: Bulimia @en
scope note: سیری‌ناپذیری یا پراشتهایی روانی. اشتهای زیاد و سیری‌ناپذیر كه در حالتهای روان‌پریشی دیده می‌شود.

اختلال در غذا خوردن
type: Concept
narrower: بیماری گرسنگی
preferred label: Eating disorder @en