آرتروز
type: Concept
alternative label: عارضه غير التهابي مفاصل متحرك
broader: اختلال عضلانی- استخوانی
preferred label: Arthrosis @en
scope note: دردهای مبهم پیوسته یا ناپیوسته بند استخوان یا جریان استحاله‌ای در مفصل.

اختلال عضلانی- استخوانی
type: Concept
narrower: آرتروز
preferred label: Musculoskeletal disorder @en