بیماری کروتسفلد- جاکوب
type: Concept
alternative label: بيماري ژاكوب- كروتزفلد
broader: بیماری مغزی
preferred label: Creutzfeldt Jacob disease @en
scope note: اسكلروز كاذب اسپاسمی كه در سنین میانی و اواخر عمر عارض می‌شود و با استحاله قسمتی از سیستمهای پیرامیدال (هرمی) و اكستراپیرامیدال (برون هرمی) مغز مشخص می‌گردد.

بیماری مغزی
type: Concept
narrower: بیماری کروتسفلد- جاکوب
preferred label: Brain disease @en