مننژیت
type: Concept
broader: بیماری مغزی
preferred label: Meningitis @en
scope note: التهاب پرده‌های مغز و نخاع كه ناشی از عفونتهای ویروسی یا باكتریایی است و موجب سردرد شدید، تب، بی‌اشتهایی، عدم تحمل نور و صدا، سختی عضلات بویژه در گردن ودر موارد شدید سبب تشنج، استفراغ و آشفتگی روانی منجر به مرگ می‌شود. درمان التهاب باكتریایی با آنتی‌بیوتیكها و التهاب ویروسی بویژه با استراحت طولانی، تاریكی و سكوت میسر است.

بیماری مغزی
type: Concept
narrower: مننژیت
preferred label: Brain disease @en