بیماری پارکینسون
type: Concept
broader: بیماری مغزی
preferred label: Parkinson’s disease @en
scope note: بیماری مغزی دوران كهولت كه همراه با سفتی و سختی حركات و تغییر رخسار و لرزش سر و دستها است.

بیماری مغزی
type: Concept
narrower: بیماری پارکینسون
preferred label: Brain disease @en