تصلب متعدد
type: Concept
alternative label: مالتيپل اسكلروزيس
broader: اختلال و بیماری عصبی
preferred label: Multiple sclerosis @en
scope note: تصلب مغز و نخاع كه در آن نقاط متعددی سفت یا سخت می‌شوند. نشانه‌های این بیماری مزمن دستگاه عصبی: گام نااستوار و حركات لرزان اندامها، حركات غیر ارادی چشمها، نقصانهایی در كلام ملفوظ، ضعف عضلانی همراه با اسپاسم، التهاب عصب بینایی. علت اساسی آسیب عصب، حاكی از پاسخ نابهنجار بیمار به یك عفونت ویروسی است.

اختلال و بیماری عصبی
type: Concept
narrower: تصلب متعدد
preferred label: Neurological disease and disorder @en