اختلال روانی
type: Concept
preferred label: Mental disorder @en
related: اختلال روان‌تنی

اختلال روان‌تنی
type: Concept
broader: بیماری
preferred label: Psychosomatic disorder @en
related: اختلال روانی
scope note: هر نوع اختلال با تظاهرات جسمی كه فرض می‌شود حداقل تا حدودی علت شناختی و هیجانی یا روانشناختی دارد، مثلا افرادی كه مشاغل پر تنشی دارند، میزان بالاتری از اختلال گوارشی و فشار خون نشان می‌دهند یا افراد مضطرب، درصد بالایی از بروز اختلالات تنفسی را به‌خود اختصاص می‌دهند.

بیماری
type: Concept
narrower: اختلال روان‌تنی
preferred label: Disease @en