التهاب نایژه
type: Concept
alternative label: برونشيت
broader: اختلال تنفسی
preferred label: Bronchitis @en
scope note: التهاب نایژه‌ها یا راههای هوای شش. این بیماری بویژه در ارتباط با استعمال دخانیات، آلودگی هوا و آمفیزم شایع است.

اختلال تنفسی
type: Concept
narrower: التهاب نایژه
preferred label: Respiratory disorder @en