اگزما
type: Concept
broader: بیماری پوست
preferred label: Eczema @en
scope note: عارضه التهابی سطحی پوست. نوعی واكنش پوست به مواد داخل یا خارج بدن كه به صورت خارش و پوسته پوسته شدن پوست بروز می‌كند.

بیماری پوست
type: Concept
narrower: اگزما
preferred label: Skin disease @en