آزار بزرگسال
type: Concept
alternative label: سالمند آزاري
broader: آزار
preferred label: Elder abuse @en
related: سالخورده
scope note: بدرفتاری یا سوء‌استفاده جسمی یا روانی از بزرگسالان ، توسط فرزندان یا اشخاصی كه مراقبت از آنها را بر عهده دارند.

آزار
type: Concept
narrower: آزار بزرگسال
preferred label: Abuse @en

سالخورده
type: Concept
preferred label: Older person @en
related: آزار بزرگسال